[obdgpslogger] Errors When Building obdgpslogger

Gregg Current currentg at knology.net
Tue Oct 9 20:26:53 EDT 2012

I am trying to build obdgpslogger for Ubuntu 12.04 running in Parallels on a
When I run make, I get the following errors:

/home/parallels/PROJECT/obdgpslogger-0.16/src/logger/gpscomm.c: In function
/home/parallels/PROJECT/obdgpslogger-0.16/src/logger/gpscomm.c:29:9: error:
too few arguments to function Œgps_open¹
/usr/include/gps.h:1717:12: note: declared here
make[2]: *** [src/logger/CMakeFiles/obdgpslogger.dir/gpscomm.c.o] Error 1
make[1]: *** [src/logger/CMakeFiles/obdgpslogger.dir/all] Error 2
make: *** [all] Error 2

I am also interested in building it for the Raspberry Pi (an ARM processor)
and would like to know what you had to do to get it to build and run on an

Gregg Current
CurrentG at knology.net
Home:   (843) 871-2308
Mobile: (843) 709-8430
Work:    (843) 218-7908

-------------- next part --------------
An HTML attachment was scrubbed...
URL: <http://icculus.org/pipermail/obdgpslogger/attachments/20121009/12b78769/attachment.htm>

More information about the obdgpslogger mailing list